Reaction Details
TargetD(2) dopamine receptor
LigandBDBM50206004
Substrate/Competitorn/a
Meas. Tech.ChEMBL_442466 (CHEMBL892631)
Ki 46±n/a nM
Citation Jung, JYJung, SHKoh, HY Asymmetric synthesis of chiral piperazinylpropylisoxazoline ligands for dopamine receptors. Eur J Med Chem42:1044-8 (2007) 
 
D(2) dopamine receptor
Name:D(2) dopamine receptor
Type:Cell-surface receptors
Mol. Mass.:50647.10
Organism:Homo sapiens (Human)
Description:P14416
Residue:443
BDBM50206004
NameBDBM50206004
Synonyms:(R)-1-(3-(3-(3,4-dimethoxyphenyl)-4,5-dihydroisoxazol-5-yl)propyl)-4-(2-ethoxyphenyl)piperazine | CHEMBL243224
TypeSmall organic molecule
Emp. Form.C26H35N3O4
Mol. Mass.453.5738
SMILESCCOc1ccccc1N1CCN(CCC[C@@H]2CC(=NO2)c2ccc(OC)c(OC)c2)CC1