Reaction Details
TargetD(4) dopamine receptor
LigandBDBM50206005
Substrate/Competitorn/a
Meas. Tech.ChEMBL_442467 (CHEMBL892632)
Ki 483±n/a nM
Citation Jung, JYJung, SHKoh, HY Asymmetric synthesis of chiral piperazinylpropylisoxazoline ligands for dopamine receptors. Eur J Med Chem42:1044-8 (2007) 
 
D(4) dopamine receptor
Name:D(4) dopamine receptor
Type:Enzyme
Mol. Mass.:48373.19
Organism:Homo sapiens (Human)
Description:P21917
Residue:419
BDBM50206005
NameBDBM50206005
Synonyms:(S)-1-(bis(4-fluorophenyl)methyl)-4-(3-(3-(3,4-dimethoxyphenyl)-4,5-dihydroisoxazol-5-yl)propyl)piperazine | CHEMBL390181
TypeSmall organic molecule
Emp. Form.C31H35F2N3O3
Mol. Mass.535.6247
SMILESCOc1ccc(cc1OC)C1=NO[C@@H](CCCN2CCN(CC2)C(c2ccc(F)cc2)c2ccc(F)cc2)C1