Reaction Details
TargetD(2) dopamine receptor
LigandBDBM50206002
Substrate/Competitorn/a
Meas. Tech.ChEMBL_442466 (CHEMBL892631)
Ki 80±n/a nM
Citation Jung, JYJung, SHKoh, HY Asymmetric synthesis of chiral piperazinylpropylisoxazoline ligands for dopamine receptors. Eur J Med Chem42:1044-8 (2007) 
 
D(2) dopamine receptor
Name:D(2) dopamine receptor
Type:Cell-surface receptors
Mol. Mass.:50647.10
Organism:Homo sapiens (Human)
Description:P14416
Residue:443
BDBM50206002
NameBDBM50206002
Synonyms:(R)-1-(bis(4-fluorophenyl)methyl)-4-(3-(3-(3,4-dimethoxyphenyl)-4,5-dihydroisoxazol-5-yl)propyl)piperazine | CHEMBL243012
TypeSmall organic molecule
Emp. Form.C31H35F2N3O3
Mol. Mass.535.6247
SMILESCOc1ccc(cc1OC)C1=NO[C@H](CCCN2CCN(CC2)C(c2ccc(F)cc2)c2ccc(F)cc2)C1