Reaction Details
TargetMuscarinic acetylcholine receptor M4
LigandBDBM50206189
Substrate/Competitorn/a
Meas. Tech.ChEMBL_454684 (CHEMBL886704)
Ki 94000±n/a nM
Citation Suckling, CJMurphy, JAKhalaf, AIZhou, SZLizos, DEvan Nhien, ANYasumatsu, HMcVie, AYoung, LCMcCraw, CWaterman, PGMorris, BJPratt, JAHarvey, AL M4 agonists/5HT7 antagonists with potential as antischizophrenic drugs: serominic compounds. Bioorg Med Chem Lett17:2649-55 (2007) 
 
Muscarinic acetylcholine receptor M4
Name:Muscarinic acetylcholine receptor M4
Type:Enzyme Catalytic Domain
Mol. Mass.:53079.31
Organism:Homo sapiens (Human)
Description:Cholinergic, muscarinic M4 CHRM4 HUMAN M3::P08173
Residue:479
BDBM50206189
NameBDBM50206189
Synonyms:1-(2-(propylthio)benzyl)-2,3,4,9-tetrahydro-1H-pyrido[3,4-b]indole | CHEMBL241100
TypeSmall organic molecule
Emp. Form.C21H24N2S
Mol. Mass.336.494
SMILESCCCSc1ccccc1CC1NCCc2c1[nH]c1ccccc21