Reaction Details
TargetMelanin-concentrating hormone receptor 1
LigandBDBM50206667
Substrate/Competitorn/a
Meas. Tech.ChEMBL_442721 (CHEMBL892889)
Ki 26±n/a nM
Citation Zhang, MTamiya, JNguyen, LRowbottom, MWDyck, BVickers, TDGrey, JSchwarz, DAHeise, CEHaelewyn, JMistry, MSGoodfellow, VS Thienopyrimidinone bis-aminopyrrolidine ureas as potent melanin-concentrating hormone receptor-1 (MCH-R1) antagonists. Bioorg Med Chem Lett17:2535-9 (2007) 
 
Melanin-concentrating hormone receptor 1
Name:Melanin-concentrating hormone receptor 1
Type:G Protein-Coupled Receptor (GPCR)
Mol. Mass.:45976.27
Organism:Homo sapiens (Human)
Description:Membranes from CHO-K1 cells stably expressing human MCH1R were used in assays.
Residue:422
BDBM50206667
NameBDBM50206667
Synonyms:(S)-3-(6-(2-chloro-4-ethoxyphenyl)-4-oxothieno[3,2-d]pyrimidin-3(4H)-yl)-N-methyl-N-((S)-1-methylpyrrolidin-3-yl)pyrrolidine-1-carboxamide | CHEMBL397421
TypeSmall organic molecule
Emp. Form.C25H30ClN5O3S
Mol. Mass.516.055
SMILESCCOc1ccc(-c2cc3ncn([C@H]4CCN(C4)C(=O)N(C)[C@H]4CCN(C)C4)c(=O)c3s2)c(Cl)c1