Reaction Details
TargetMelanin-concentrating hormone receptor 1
LigandBDBM50206674
Substrate/Competitorn/a
Meas. Tech.ChEMBL_442721 (CHEMBL892889)
Ki 45±n/a nM
Citation Zhang, MTamiya, JNguyen, LRowbottom, MWDyck, BVickers, TDGrey, JSchwarz, DAHeise, CEHaelewyn, JMistry, MSGoodfellow, VS Thienopyrimidinone bis-aminopyrrolidine ureas as potent melanin-concentrating hormone receptor-1 (MCH-R1) antagonists. Bioorg Med Chem Lett17:2535-9 (2007) 
 
Melanin-concentrating hormone receptor 1
Name:Melanin-concentrating hormone receptor 1
Type:G Protein-Coupled Receptor (GPCR)
Mol. Mass.:45976.27
Organism:Homo sapiens (Human)
Description:Membranes from CHO-K1 cells stably expressing human MCH1R were used in assays.
Residue:422
BDBM50206674
NameBDBM50206674
Synonyms:(S)-3-(6-(2,3-dihydrobenzo[b][1,4]dioxin-6-yl)-4-oxothieno[3,2-d]pyrimidin-3(4H)-yl)-N-methyl-N-((S)-1-(tetrahydro-2H-pyran-4-yl)pyrrolidin-3-yl)pyrrolidine-1-carboxamide | CHEMBL395979
TypeSmall organic molecule
Emp. Form.C29H35N5O5S
Mol. Mass.565.684
SMILESCN([C@H]1CCN(C1)C1CCOCC1)C(=O)N1CC[C@@H](C1)n1cnc2cc(sc2c1=O)-c1ccc2OCCOc2c1