Reaction Details
TargetMelanin-concentrating hormone receptor 1
LigandBDBM50206679
Substrate/Competitorn/a
Meas. Tech.ChEMBL_442721 (CHEMBL892889)
Ki 3±n/a nM
Citation Zhang, MTamiya, JNguyen, LRowbottom, MWDyck, BVickers, TDGrey, JSchwarz, DAHeise, CEHaelewyn, JMistry, MSGoodfellow, VS Thienopyrimidinone bis-aminopyrrolidine ureas as potent melanin-concentrating hormone receptor-1 (MCH-R1) antagonists. Bioorg Med Chem Lett17:2535-9 (2007) 
 
Melanin-concentrating hormone receptor 1
Name:Melanin-concentrating hormone receptor 1
Type:G Protein-Coupled Receptor (GPCR)
Mol. Mass.:45976.27
Organism:Homo sapiens (Human)
Description:Membranes from CHO-K1 cells stably expressing human MCH1R were used in assays.
Residue:422
BDBM50206679
NameBDBM50206679
Synonyms:(S)-3-(6-(4-chlorophenyl)-4-oxothieno[3,2-d]pyrimidin-3(4H)-yl)-N-((S)-1-(cyclopropylmethyl)pyrrolidin-3-yl)-N-methylpyrrolidine-1-carboxamide | CHEMBL394560
TypeSmall organic molecule
Emp. Form.C26H30ClN5O2S
Mol. Mass.512.067
SMILESCN([C@H]1CCN(CC2CC2)C1)C(=O)N1CC[C@@H](C1)n1cnc2cc(sc2c1=O)-c1ccc(Cl)cc1