Reaction Details
TargetProstaglandin G/H synthase 1
LigandBDBM50207446
Substrate/Competitorn/a
Meas. Tech.ChEMBL_461152 (CHEMBL944175)
IC50>10000±n/a nM
Citation Blobaum, ALMarnett, LJ Structural and functional basis of cyclooxygenase inhibition. J Med Chem50:1425-41 (2007) 
 
Prostaglandin G/H synthase 1
Name:Prostaglandin G/H synthase 1
Type:Enzyme
Mol. Mass.:68692.62
Organism:Homo sapiens (Human)
Description:P23219
Residue:599
BDBM50207446
NameBDBM50207446
Synonyms:2-(2-(2-chloro-6-fluorophenylamino)-5-methylphenyl)acetic acid | CHEMBL404108
TypeSmall organic molecule
Emp. Form.C15H13ClFNO2
Mol. Mass.293.721
SMILESCc1ccc(Nc2c(F)cccc2Cl)c(CC(O)=O)c1