Reaction Details
TargetProstaglandin G/H synthase 1
LigandBDBM17638
Substrate/Competitorn/a
Meas. Tech.ChEMBL_461152 (CHEMBL944175)
IC50 6±n/a nM
Citation Blobaum, ALMarnett, LJ Structural and functional basis of cyclooxygenase inhibition. J Med Chem50:1425-41 (2007) 
 
Prostaglandin G/H synthase 1
Name:Prostaglandin G/H synthase 1
Type:Enzyme
Mol. Mass.:68692.62
Organism:Homo sapiens (Human)
Description:P23219
Residue:599
BDBM17638
NameBDBM17638
Synonyms:2-{1-[(4-chlorophenyl)carbonyl]-5-methoxy-2-methyl-1H-indol-3-yl}acetic acid Indocin US11478464, Compound Indomethacin US9271961, Indomethacin | indometacin
TypeSmall organic molecule
Emp. Form.C19H16ClNO4
Mol. Mass.357.788
SMILESCOc1ccc2n(C(=O)c3ccc(Cl)cc3)c(C)c(CC(O)=O)c2c1