Reaction Details
TargetProstaglandin G/H synthase 1
LigandBDBM50207449
Substrate/Competitorn/a
Meas. Tech.ChEMBL_461152 (CHEMBL944175)
IC50>66000±n/a nM
Citation Blobaum, ALMarnett, LJ Structural and functional basis of cyclooxygenase inhibition. J Med Chem50:1425-41 (2007) 
 
Prostaglandin G/H synthase 1
Name:Prostaglandin G/H synthase 1
Type:Enzyme
Mol. Mass.:68692.62
Organism:Homo sapiens (Human)
Description:P23219
Residue:599
BDBM50207449
NameBDBM50207449
Synonyms:2-(1-(4-bromobenzyl)-5-methoxy-2-methyl-1H-indol-3-yl)ethyl 4-chlorobenzoate | CHEMBL404107
TypeSmall organic molecule
Emp. Form.C26H23BrClNO3
Mol. Mass.512.823
SMILESCOc1ccc2n(Cc3ccc(Br)cc3)c(C)c(CCOC(=O)c3ccc(Cl)cc3)c2c1