Reaction Details
TargetProstaglandin G/H synthase 2
LigandBDBM22967
Substrate/Competitorn/a
Meas. Tech.ChEMBL_461151 (CHEMBL944174)
IC50 50±n/a nM
Citation Blobaum, ALMarnett, LJ Structural and functional basis of cyclooxygenase inhibition. J Med Chem50:1425-41 (2007) 
 
Prostaglandin G/H synthase 2
Name:Prostaglandin G/H synthase 2
Type:Enzyme
Mol. Mass.:69003.89
Organism:Homo sapiens (Human)
Description:Recombinant Cox-2 provided by Cayman (Cayman Chemical Co.,Ann Arbor, MI).
Residue:604
BDBM22967
NameBDBM22967
Synonyms:2-phenylethyl 2-{1-[(4-chlorophenyl)carbonyl]-5-methoxy-2-methyl-1H-indol-3-yl}acetate Indomethacin derivative, 20
TypeSmall organic molecule
Emp. Form.C27H24ClNO4
Mol. Mass.461.937
SMILESCOc1ccc2n(C(=O)c3ccc(Cl)cc3)c(C)c(CC(=O)OCCc3ccccc3)c2c1