Reaction Details
TargetMu-type opioid receptor
LigandBDBM50207832
Substrate/Competitorn/a
Meas. Tech.ChEMBL_455043 (CHEMBL887072)
EC50 49±n/a nM
Citation Dolle, REMichaut, MMartinez-Teipel, BBelanger, SGraczyk, TMDeHaven, RN Further studies of tyrosine surrogates in opioid receptor peptide ligands. Bioorg Med Chem Lett17:2656-60 (2007) 
 
Mu-type opioid receptor
Name:Mu-type opioid receptor
Type:G Protein-Coupled Receptor (GPCR)
Mol. Mass.:44789.51
Organism:Homo sapiens (Human)
Description:P35372
Residue:400
BDBM50207832
NameBDBM50207832
Synonyms:CHEMBL247758 | H-Cdp-ala-Gly-Phe-leu-OH
TypeSmall organic molecule
Emp. Form.C32H44N6O7
Mol. Mass.624.7278
SMILESCC(C)C[C@H](NC(=O)[C@H](Cc1ccccc1)NC(=O)CNC(=O)[C@H](C)NC(=O)[C@@H](N)Cc1c(C)cc(cc1C)C(N)=O)C(O)=O