Reaction Details
TargetDelta-type opioid receptor
LigandBDBM50207822
Substrate/Competitorn/a
Meas. Tech.ChEMBL_455044 (CHEMBL887073)
EC50 10±n/a nM
Citation Dolle, REMichaut, MMartinez-Teipel, BBelanger, SGraczyk, TMDeHaven, RN Further studies of tyrosine surrogates in opioid receptor peptide ligands. Bioorg Med Chem Lett17:2656-60 (2007) 
 
Delta-type opioid receptor
Name:Delta-type opioid receptor
Type:G Protein-Coupled Receptor (GPCR)
Mol. Mass.:40382.98
Organism:Homo sapiens (Human)
Description:Competition binding assays were carried out using membrane preparations from transfected HN9.10 cells that constitutively expressed the delta opioid receptor.
Residue:372
BDBM50207822
NameBDBM50207822
Synonyms:CHEMBL246956 | H-Cpa-Gly-Gly-Phe-Met-NH2
TypeSmall organic molecule
Emp. Form.C28H37N7O6S
Mol. Mass.599.702
SMILESCSCC[C@H](NC(=O)[C@H](Cc1ccccc1)NC(=O)CNC(=O)CNC(=O)[C@@H](N)Cc1ccc(cc1)C(N)=O)C(N)=O