Reaction Details
TargetKappa-type opioid receptor
LigandBDBM50207837
Substrate/Competitorn/a
Meas. Tech.ChEMBL_455041 (CHEMBL887070)
Ki>10000±n/a nM
Citation Dolle, REMichaut, MMartinez-Teipel, BBelanger, SGraczyk, TMDeHaven, RN Further studies of tyrosine surrogates in opioid receptor peptide ligands. Bioorg Med Chem Lett17:2656-60 (2007) 
 
Kappa-type opioid receptor
Name:Kappa-type opioid receptor
Type:G Protein-Coupled Receptor (GPCR)
Mol. Mass.:42648.76
Organism:Homo sapiens (Human)
Description:P41145
Residue:380
BDBM50207837
NameBDBM50207837
Synonyms:CHEMBL247163 | H-Cxp-ala-Gly-Phe-leu-OH
TypeSmall organic molecule
Emp. Form.C30H39N5O8
Mol. Mass.597.6594
SMILESCC(C)C[C@H](NC(=O)[C@H](Cc1ccccc1)NC(=O)CNC(=O)[C@H](C)NC(=O)[C@@H](N)Cc1ccc(cc1)C(O)=O)C(O)=O