Reaction Details
TargetKappa-type opioid receptor
LigandBDBM50207831
Substrate/Competitorn/a
Meas. Tech.ChEMBL_455041 (CHEMBL887070)
Ki 1030±n/a nM
Citation Dolle, REMichaut, MMartinez-Teipel, BBelanger, SGraczyk, TMDeHaven, RN Further studies of tyrosine surrogates in opioid receptor peptide ligands. Bioorg Med Chem Lett17:2656-60 (2007) 
 
Kappa-type opioid receptor
Name:Kappa-type opioid receptor
Type:G Protein-Coupled Receptor (GPCR)
Mol. Mass.:42648.76
Organism:Homo sapiens (Human)
Description:P41145
Residue:380
BDBM50207831
NameBDBM50207831
Synonyms:CHEMBL391580 | H-Cpa-Gly-Gly-Phe-Met-OH
TypeSmall organic molecule
Emp. Form.C28H36N6O7S
Mol. Mass.600.686
SMILESCSCC[C@H](NC(=O)[C@H](Cc1ccccc1)NC(=O)CNC(=O)CNC(=O)[C@@H](N)Cc1ccc(cc1)C(N)=O)C(O)=O