Reaction Details
TargetMu-type opioid receptor
LigandBDBM50207835
Substrate/Competitorn/a
Meas. Tech.ChEMBL_455039 (CHEMBL887068)
Ki 640±n/a nM
Citation Dolle, REMichaut, MMartinez-Teipel, BBelanger, SGraczyk, TMDeHaven, RN Further studies of tyrosine surrogates in opioid receptor peptide ligands. Bioorg Med Chem Lett17:2656-60 (2007) 
 
Mu-type opioid receptor
Name:Mu-type opioid receptor
Type:G Protein-Coupled Receptor (GPCR)
Mol. Mass.:44789.51
Organism:Homo sapiens (Human)
Description:P35372
Residue:400
BDBM50207835
NameBDBM50207835
Synonyms:CHEMBL246479 | H-Aba-ser-Gly-Phe-Leu-Thr-OH
TypeSmall organic molecule
Emp. Form.C34H46N8O9S
Mol. Mass.742.842
SMILESCC(C)C[C@H](NC(=O)[C@H](Cc1ccccc1)NC(=O)CNC(=O)[C@H](CO)NC(=O)[C@@H](N)Cc1ccc2nc(N)sc2c1)C(=O)N[C@@H]([C@@H](C)O)C(O)=O