Reaction Details
TargetPotassium voltage-gated channel subfamily A member 5
LigandBDBM50207908
Substrate/Competitorn/a
Meas. Tech.ChEMBL_455075 (CHEMBL887104)
IC50 760±n/a nM
Citation Gross, MFBeaudoin, SMcNaughton-Smith, GAmato, GSCastle, NAHuang, CZou, AYu, W Aryl sulfonamido indane inhibitors of the Kv1.5 ion channel. Bioorg Med Chem Lett17:2849-53 (2007) 
 
Potassium voltage-gated channel subfamily A member 5
Name:Potassium voltage-gated channel subfamily A member 5
Type:Enzyme
Mol. Mass.:67222.47
Organism:Homo sapiens (Human)
Description:P22460
Residue:613
BDBM50207908
NameBDBM50207908
Synonyms:CHEMBL391455 | N-((2S,3S)-3-(4-ethylphenylsulfonamido)-2-hydroxy-2,3-dihydro-1H-inden-5-yl)-3-methoxybenzamide
TypeSmall organic molecule
Emp. Form.C25H26N2O5S
Mol. Mass.466.549
SMILESCCc1ccc(cc1)S(=O)(=O)N[C@@H]1[C@@H](O)Cc2ccc(NC(=O)c3cccc(OC)c3)cc12