Reaction Details
TargetHydroxycarboxylic acid receptor 3
LigandBDBM50208116
Substrate/Competitorn/a
Meas. Tech.ChEMBL_429282 (CHEMBL915841)
EC50 3700±n/a nM
Citation Jung, JKJohnson, BRDuong, TDecaire, MUy, JGharbaoui, TBoatman, PDSage, CRChen, RRichman, JGConnolly, DTSemple, G Analogues of acifran: agonists of the high and low affinity niacin receptors, GPR109a and GPR109b. J Med Chem50:1445-8 (2007) 
 
Hydroxycarboxylic acid receptor 3
Name:Hydroxycarboxylic acid receptor 3
Type:Enzyme Catalytic Domain
Mol. Mass.:44498.06
Organism:Homo sapiens (Human)
Description:GPR109B 0 HUMAN::P49019
Residue:387
BDBM50208116
NameBDBM50208116
Synonyms:5-(5-chloro-thiophen-2-yl)-5-methyl-4-oxo-4,5-dihydro-furan-2-carboxylic acid | CHEMBL424750
TypeSmall organic molecule
Emp. Form.C10H7ClO4S
Mol. Mass.258.678
SMILESCC1(OC(=CC1=O)C(O)=O)c1ccc(Cl)s1