Reaction Details
TargetHydroxycarboxylic acid receptor 3
LigandBDBM50208139
Substrate/Competitorn/a
Meas. Tech.ChEMBL_429282 (CHEMBL915841)
EC50 4200±n/a nM
Citation Jung, JKJohnson, BRDuong, TDecaire, MUy, JGharbaoui, TBoatman, PDSage, CRChen, RRichman, JGConnolly, DTSemple, G Analogues of acifran: agonists of the high and low affinity niacin receptors, GPR109a and GPR109b. J Med Chem50:1445-8 (2007) 
 
Hydroxycarboxylic acid receptor 3
Name:Hydroxycarboxylic acid receptor 3
Type:Enzyme Catalytic Domain
Mol. Mass.:44498.06
Organism:Homo sapiens (Human)
Description:GPR109B 0 HUMAN::P49019
Residue:387
BDBM50208139
NameBDBM50208139
Synonyms:5-methyl-4-oxo-5-thiophen-3-yl-4,5-dihydro-furan-2-carboxylic acid | CHEMBL223140
TypeSmall organic molecule
Emp. Form.C10H8O4S
Mol. Mass.224.233
SMILESCC1(OC(=CC1=O)C(O)=O)c1ccsc1