Reaction Details
TargetReplicase polyprotein 1a
LigandBDBM50208944
Substrate/Competitorn/a
Meas. Tech.ChEMBL_429518 (CHEMBL918059)
IC50 340±n/a nM
Citation Zhang, JPettersson, HIHuitema, CNiu, CYin, JJames, MNEltis, LDVederas, JC Design, synthesis, and evaluation of inhibitors for severe acute respiratory syndrome 3C-like protease based on phthalhydrazide ketones or heteroaromatic esters. J Med Chem50:1850-64 (2007) 
 
Replicase polyprotein 1a
Name:Replicase polyprotein 1a
Type:Enzyme
Mol. Mass.:486353.36
Organism:Human SARS coronavirus (SARS-CoV)
Description:P0C6U8
Residue:4382
BDBM50208944
NameBDBM50208944
Synonyms:5-chloropyridin-3-yl 3-methoxybenzoate CHEMBL222735 | acs.jmedchem.1c00409_ST.145
TypeSmall organic molecule
Emp. Form.C13H10ClNO3
Mol. Mass.263.676
SMILESCOc1cccc(c1)C(=O)Oc1cncc(Cl)c1