Reaction Details
TargetReplicase polyprotein 1a
LigandBDBM50208943
Substrate/Competitorn/a
Meas. Tech.ChEMBL_429518 (CHEMBL918059)
IC50 170±n/a nM
Citation Zhang, JPettersson, HIHuitema, CNiu, CYin, JJames, MNEltis, LDVederas, JC Design, synthesis, and evaluation of inhibitors for severe acute respiratory syndrome 3C-like protease based on phthalhydrazide ketones or heteroaromatic esters. J Med Chem50:1850-64 (2007) 
 
Replicase polyprotein 1a
Name:Replicase polyprotein 1a
Type:Enzyme
Mol. Mass.:486353.36
Organism:Human SARS coronavirus (SARS-CoV)
Description:P0C6U8
Residue:4382
BDBM50208943
NameBDBM50208943
Synonyms:5-chloropyridin-3-yl benzofuran-2-carboxylate acs.jmedchem.1c00409_ST.433
TypeSmall organic molecule
Emp. Form.C14H8ClNO3
Mol. Mass.273.671
SMILESClc1cncc(OC(=O)c2cc3ccccc3o2)c1