Reaction Details
TargetIntegrin alpha-V/beta-3
LigandBDBM50209120
Substrate/Competitorn/a
Meas. Tech.ChEMBL_436007 (CHEMBL905412)
IC50 0.9±n/a nM
Citation Nagarajan, SRLu, HFGasiecki, AFKhanna, IKParikh, MDDesai, BNRogers, TEClare, MChen, BBRussell, MAKeene, JLDuffin, TEngleman, VWFinn, MBFreeman, SKKlover, JANickols, GANickols, MAShannon, KESteininger, CAWestlin, WFWestlin, MMWilliams, ML Discovery of +(2-{4-[2-(5,6,7,8-tetrahydro-1,8-naphthyridin-2-yl)ethoxy]phenyl}-cyclopropyl)acetic acid as potent and selective alphavbeta3 inhibitor: design, synthesis, and optimization. Bioorg Med Chem15:3390-412 (2007) 
 
Integrin alpha-V/beta-3
Name:Integrin alpha-V/beta-3
Type:Enzyme
Mol. Mass.:n/a
Description:n/a
Components:This complex has 2 components.
Component 1
Name:Integrin alpha-V
Synonyms:ITAV_HUMAN Integrin alpha-V/alpha-5 VNRA Vitronectin receptor | Vitronectin receptor subunit alpha
Type:PROTEIN
Mol. Mass.:116024.92
Organism:Homo sapiens (Human)
Description:ChEMBL_582336
Residue:1048
Component 2
Name:Integrin beta-3
Synonyms:CD_antigen=CD61 GPIIIa ITGB3 Platelet membrane glycoprotein IIIa
Type:Protein
Mol. Mass.:87038.91
Organism:Homo sapiens (Human)
Description:P05106
Residue:788
BDBM50209120
NameBDBM50209120
Synonyms:(2-{3-hydroxy-4-[2-(5,6,7,8-tetrahydro-1,8-naphthyridin-2-yl)ethoxy]phenyl}-cyclopropyl)acetic acid | CHEMBL226000
TypeSmall organic molecule
Emp. Form.C21H24N2O4
Mol. Mass.368.4263
SMILESOC(=O)CC1CC1c1ccc(OCCc2ccc3CCCNc3n2)c(O)c1