Reaction Details
TargetIntegrin alpha-V/beta-1
LigandBDBM50209132
Substrate/Competitorn/a
Meas. Tech.ChEMBL_436006 (CHEMBL905411)
IC50 11±n/a nM
Citation Nagarajan, SRLu, HFGasiecki, AFKhanna, IKParikh, MDDesai, BNRogers, TEClare, MChen, BBRussell, MAKeene, JLDuffin, TEngleman, VWFinn, MBFreeman, SKKlover, JANickols, GANickols, MAShannon, KESteininger, CAWestlin, WFWestlin, MMWilliams, ML Discovery of +(2-{4-[2-(5,6,7,8-tetrahydro-1,8-naphthyridin-2-yl)ethoxy]phenyl}-cyclopropyl)acetic acid as potent and selective alphavbeta3 inhibitor: design, synthesis, and optimization. Bioorg Med Chem15:3390-412 (2007) 
 
Integrin alpha-V/beta-1
Name:Integrin alpha-V/beta-1
Type:Enzyme
Mol. Mass.:n/a
Description:n/a
Components:This complex has 2 components.
Component 1
Name:Integrin alpha-V
Synonyms:ITAV_HUMAN Integrin alpha-V/alpha-5 VNRA Vitronectin receptor | Vitronectin receptor subunit alpha
Type:PROTEIN
Mol. Mass.:116024.92
Organism:Homo sapiens (Human)
Description:ChEMBL_582336
Residue:1048
Component 2
Name:Integrin beta-1
Synonyms:CD_antigen=CD29 Fibronectin receptor beta GPIIA ITGB1 MDF2 | MSK12
Type:Enzyme
Mol. Mass.:88400.38
Organism:Homo sapiens (Human)
Description:P05556
Residue:798
BDBM50209132
NameBDBM50209132
Synonyms:(2-{3-fluoro-4-[3-(5,6,7,8-tetrahydro-1,8-naphthyridin-2-ylamino)propoxy]-phenyl}cyclopropyl)acetic acid | CHEMBL226050
TypeSmall organic molecule
Emp. Form.C21H23FN2O3
Mol. Mass.370.4173
SMILESOC(=O)CC1CC1c1ccc(OCCc2ccc3CCCNc3n2)c(F)c1