Reaction Details
TargetIntegrin alpha-V/beta-1
LigandBDBM50209131
Substrate/Competitorn/a
Meas. Tech.ChEMBL_436006 (CHEMBL905411)
IC50 28±n/a nM
Citation Nagarajan, SRLu, HFGasiecki, AFKhanna, IKParikh, MDDesai, BNRogers, TEClare, MChen, BBRussell, MAKeene, JLDuffin, TEngleman, VWFinn, MBFreeman, SKKlover, JANickols, GANickols, MAShannon, KESteininger, CAWestlin, WFWestlin, MMWilliams, ML Discovery of +(2-{4-[2-(5,6,7,8-tetrahydro-1,8-naphthyridin-2-yl)ethoxy]phenyl}-cyclopropyl)acetic acid as potent and selective alphavbeta3 inhibitor: design, synthesis, and optimization. Bioorg Med Chem15:3390-412 (2007) 
 
Integrin alpha-V/beta-1
Name:Integrin alpha-V/beta-1
Type:Enzyme
Mol. Mass.:n/a
Description:n/a
Components:This complex has 2 components.
Component 1
Name:Integrin alpha-V
Synonyms:ITAV_HUMAN Integrin alpha-V/alpha-5 VNRA Vitronectin receptor | Vitronectin receptor subunit alpha
Type:PROTEIN
Mol. Mass.:116024.92
Organism:Homo sapiens (Human)
Description:ChEMBL_582336
Residue:1048
Component 2
Name:Integrin beta-1
Synonyms:CD_antigen=CD29 Fibronectin receptor beta GPIIA ITGB1 MDF2 | MSK12
Type:Enzyme
Mol. Mass.:88400.38
Organism:Homo sapiens (Human)
Description:P05556
Residue:798
BDBM50209131
NameBDBM50209131
Synonyms:4-[3-(2-N-pyridyl)amino]-1-propyloxyphenyl-3-(3-pyridyl)butyric acid | CHEMBL226357
TypeSmall organic molecule
Emp. Form.C23H25N3O3
Mol. Mass.391.4629
SMILESOC(=O)CC(Cc1ccc(OCCCNc2ccccn2)cc1)c1cccnc1