Reaction Details
TargetSodium-dependent serotonin transporter
LigandBDBM50209175
Substrate/Competitorn/a
Meas. Tech.ChEMBL_443460 (CHEMBL893718)
IC50 1±n/a nM
Citation Deskus, JAEpperson, JRSloan, CPCipollina, JADextraze, PQian-Cutrone, JGao, QMa, BBeno, BRMattson, GKMolski, TFKrause, RGTaber, MTLodge, NJMattson, RJ Conformationally restricted homotryptamines 3. Indole tetrahydropyridines and cyclohexenylamines as selective serotonin reuptake inhibitors. Bioorg Med Chem Lett17:3099-104 (2007) 
 
Sodium-dependent serotonin transporter
Name:Sodium-dependent serotonin transporter
Type:Multi-pass membrane protein
Mol. Mass.:70322.51
Organism:Homo sapiens (Human)
Description:P31645
Residue:630
BDBM50209175
NameBDBM50209175
Synonyms:CHEMBL396537 | N,N-dimethyl-4-(5-nitro-1H-indol-3-yl)cyclohex-3-enamine
TypeSmall organic molecule
Emp. Form.C16H19N3O2
Mol. Mass.285.341
SMILESCN(C)C1CCC(=CC1)c1c[nH]c2ccc(cc12)[N+]([O-])=O