Reaction Details
TargetNeuronal acetylcholine receptor subunit alpha-7
LigandBDBM50202318
Substrate/Competitorn/a
Meas. Tech.ChEMBL_436055 (CHEMBL905460)
IC50 81000±n/a nM
Citation Iturriaga-Vásquez, PPérez, EGSlater, EYBermúdez, ICassels, BK Aporphine metho salts as neuronal nicotinic acetylcholine receptor blockers. Bioorg Med Chem15:3368-72 (2007) 
 
Neuronal acetylcholine receptor subunit alpha-7
Name:Neuronal acetylcholine receptor subunit alpha-7
Type:n/a
Mol. Mass.:56448.33
Organism:Homo sapiens (Human)
Description: CHRNA7 (NACHRA7)
Residue:502
BDBM50202318
NameBDBM50202318
Synonyms:(+)-boldine (S)-1,10-dimethoxy-6-methyl-5,6,6a,7-tetrahydro-4H-dibenzo[de,g]quinoline-2,9-diol boldine cid_248507
TypeSmall organic molecule
Emp. Form.C19H21NO4
Mol. Mass.327.3743
SMILESCOc1cc-2c(C[C@@H]3N(C)CCc4cc(O)c(OC)c-2c34)cc1O