Reaction Details
TargetReceptor-type tyrosine-protein phosphatase C
LigandBDBM50292296
Substrate/Competitorn/a
Meas. Tech.ChEMBL_434271 (CHEMBL918431)
IC50>1000000±n/a nM
Citation Vazquez, JTautz, LRyan, JJVuori, KMustelin, TPellecchia, M Development of molecular probes for second-site screening and design of protein tyrosine phosphatase inhibitors. J Med Chem50:2137-43 (2007) 
 
Receptor-type tyrosine-protein phosphatase C
Name:Receptor-type tyrosine-protein phosphatase C
Type:Protein
Mol. Mass.:147474.19
Organism:Homo sapiens (Human)
Description:P08575
Residue:1306
BDBM50292296
NameBDBM50292296
Synonyms:(E)-2,2,6,6-tetramethyl-4-(3-(5-(4-nitrophenyl)furan-2-yl)acrylamido)piperidin-1-olate | CHEMBL390088
TypeSmall organic molecule
Emp. Form.C22H26N3O5
Mol. Mass.412.4589
SMILESCC1(C)CC(CC(C)(C)N1[O])NC(=O)\C=C\c1ccc(o1)-c1ccc(cc1)[N+]([O-])=O