Reaction Details
TargetReceptor-type tyrosine-protein phosphatase C
LigandBDBM50292297
Substrate/Competitorn/a
Meas. Tech.ChEMBL_434271 (CHEMBL918431)
IC50>1000000±n/a nM
Citation Vazquez, JTautz, LRyan, JJVuori, KMustelin, TPellecchia, M Development of molecular probes for second-site screening and design of protein tyrosine phosphatase inhibitors. J Med Chem50:2137-43 (2007) 
 
Receptor-type tyrosine-protein phosphatase C
Name:Receptor-type tyrosine-protein phosphatase C
Type:Protein
Mol. Mass.:147474.19
Organism:Homo sapiens (Human)
Description:P08575
Residue:1306
BDBM50292297
NameBDBM50292297
Synonyms:CHEMBL227608 | Methyl 2-hydroxy-5-(5-(((1-hydroxy-2,2,6,6-tetramethylpiperidin-4-yl)amino)methyl)furan-2-yl)benzoate
TypeSmall organic molecule
Emp. Form.C22H29N2O5
Mol. Mass.401.4761
SMILESCOC(=O)c1cc(ccc1O)-c1ccc(CNC2CC(C)(C)N([O])C(C)(C)C2)o1