Reaction Details
TargetDual specificity protein phosphatase 3
LigandBDBM50292293
Substrate/Competitorn/a
Meas. Tech.ChEMBL_434272 (CHEMBL918432)
IC50>1000000±n/a nM
Citation Vazquez, JTautz, LRyan, JJVuori, KMustelin, TPellecchia, M Development of molecular probes for second-site screening and design of protein tyrosine phosphatase inhibitors. J Med Chem50:2137-43 (2007) 
 
Dual specificity protein phosphatase 3
Name:Dual specificity protein phosphatase 3
Type:Hydrolase
Mol. Mass.:20480.58
Organism:Homo sapiens (Human)
Description:n/a
Residue:185
BDBM50292293
NameBDBM50292293
Synonyms:4-(5-((4-hydroxy-3-(methoxycarbonyl)phenyl)amino)-5-oxopentanamido)-2,2,6,6-tetramethylpiperidin-1-olate | CHEMBL265864
TypeSmall organic molecule
Emp. Form.C22H32N3O6
Mol. Mass.434.506
SMILESCOC(=O)c1cc(NC(=O)CCCC(=O)NC2CC(C)(C)N([O])C(C)(C)C2)ccc1O