Reaction Details
TargetTyrosine-protein phosphatase non-receptor type 1
LigandBDBM50292294
Substrate/Competitorn/a
Meas. Tech.ChEMBL_434269 (CHEMBL918429)
IC50>1000000±n/a nM
Citation Vazquez, JTautz, LRyan, JJVuori, KMustelin, TPellecchia, M Development of molecular probes for second-site screening and design of protein tyrosine phosphatase inhibitors. J Med Chem50:2137-43 (2007) 
 
Tyrosine-protein phosphatase non-receptor type 1
Name:Tyrosine-protein phosphatase non-receptor type 1
Type:Protein phosphatase
Mol. Mass.:49963.76
Organism:Homo sapiens (Human)
Description:Human recombinant GST-fusion PTP1B (1-435).
Residue:435
BDBM50292294
NameBDBM50292294
Synonyms:4-(5-((3-carboxy-4-hydroxyphenyl)amino)-5-oxopentanamido)-2,2,6,6-tetramethylpiperidin-1-olate | CHEMBL445152
TypeSmall organic molecule
Emp. Form.C21H30N3O6
Mol. Mass.420.4794
SMILESCC1(C)CC(CC(C)(C)N1[O])NC(=O)CCCC(=O)Nc1ccc(O)c(c1)C(O)=O