Reaction Details
TargetReceptor-type tyrosine-protein phosphatase C
LigandBDBM50292295
Substrate/Competitorn/a
Meas. Tech.ChEMBL_434271 (CHEMBL918431)
IC50>1000000±n/a nM
Citation Vazquez, JTautz, LRyan, JJVuori, KMustelin, TPellecchia, M Development of molecular probes for second-site screening and design of protein tyrosine phosphatase inhibitors. J Med Chem50:2137-43 (2007) 
 
Receptor-type tyrosine-protein phosphatase C
Name:Receptor-type tyrosine-protein phosphatase C
Type:Protein
Mol. Mass.:147474.19
Organism:Homo sapiens (Human)
Description:P08575
Residue:1306
BDBM50292295
NameBDBM50292295
Synonyms:2-hydroxy-5-(5-(((1-hydroxy-2,2,6,6-tetramethylpiperidin-4-yl)amino)methyl)furan-2-yl)benzoic acid | CHEMBL390576
TypeSmall organic molecule
Emp. Form.C21H27N2O5
Mol. Mass.387.4495
SMILESCC1(C)CC(CC(C)(C)N1[O])NCc1ccc(o1)-c1ccc(O)c(c1)C(O)=O