Reaction Details
TargetTyrosine-protein phosphatase non-receptor type 2
LigandBDBM50292297
Substrate/Competitorn/a
Meas. Tech.ChEMBL_434270 (CHEMBL918430)
IC50>1000000±n/a nM
Citation Vazquez, JTautz, LRyan, JJVuori, KMustelin, TPellecchia, M Development of molecular probes for second-site screening and design of protein tyrosine phosphatase inhibitors. J Med Chem50:2137-43 (2007) 
 
Tyrosine-protein phosphatase non-receptor type 2
Name:Tyrosine-protein phosphatase non-receptor type 2
Type:Protein
Mol. Mass.:48481.80
Organism:Homo sapiens (Human)
Description:P17706
Residue:415
BDBM50292297
NameBDBM50292297
Synonyms:CHEMBL227608 | Methyl 2-hydroxy-5-(5-(((1-hydroxy-2,2,6,6-tetramethylpiperidin-4-yl)amino)methyl)furan-2-yl)benzoate
TypeSmall organic molecule
Emp. Form.C22H29N2O5
Mol. Mass.401.4761
SMILESCOC(=O)c1cc(ccc1O)-c1ccc(CNC2CC(C)(C)N([O])C(C)(C)C2)o1