Reaction Details
TargetCocaine esterase
LigandBDBM50209414
Substrate/Competitorn/a
Meas. Tech.ChEMBL_443527 (CHEMBL893784)
Ki 25.9±n/a nM
Citation Hicks, LDHyatt, JLMoak, TEdwards, CCTsurkan, LWierdl, MFerreira, AMWadkins, RMPotter, PM Analysis of the inhibition of mammalian carboxylesterases by novel fluorobenzoins and fluorobenzils. Bioorg Med Chem15:3801-17 (2007) 
 
Cocaine esterase
Name:Cocaine esterase
Type:PROTEIN
Mol. Mass.:61801.08
Organism:Homo sapiens (Human)
Description:ChEMBL_1494240
Residue:559
BDBM50209414
NameBDBM50209414
Synonyms:1,2-bis(3-fluorophenyl)ethane-1,2-dione | CHEMBL242067
TypeSmall organic molecule
Emp. Form.C14H8F2O2
Mol. Mass.246.2089
SMILESFc1cccc(c1)C(=O)C(=O)c1cccc(F)c1