Reaction Details
TargetIntegrin alpha-V/beta-6
LigandBDBM50209448
Substrate/Competitorn/a
Meas. Tech.ChEMBL_443534 (CHEMBL893791)
IC50 42±n/a nM
Citation Nagarajan, SRDevadas, BMalecha, JWLu, HFRuminski, PGRico, JGRogers, TEMarrufo, LDCollins, JTKleine, HPLantz, MKZhu, JGreen, NFRussell, MALandis, BHMiller, LMMeyer, DMDuffin, TDEngleman, VWFinn, MBFreeman, SKGriggs, DWWilliams, MLNickols, MAPegg, JAShannon, KESteininger, CWestlin, MMNickols, GAKeene, JL R-isomers of Arg-Gly-Asp (RGD) mimics as potent alphavbeta3 inhibitors. Bioorg Med Chem15:3783-800 (2007) 
 
Integrin alpha-V/beta-6
Name:Integrin alpha-V/beta-6
Type:Enzyme
Mol. Mass.:n/a
Description:n/a
Components:This complex has 2 components.
Component 1
Name:Integrin alpha-V
Synonyms:ITAV_HUMAN Integrin alpha-V/alpha-5 VNRA Vitronectin receptor | Vitronectin receptor subunit alpha
Type:PROTEIN
Mol. Mass.:116024.92
Organism:Homo sapiens (Human)
Description:ChEMBL_582336
Residue:1048
Component 2
Name:Integrin beta-6
Synonyms:ITB6_HUMAN | ITGB6
Type:PROTEIN
Mol. Mass.:85919.61
Organism:Homo sapiens (Human)
Description:EBI_10916
Residue:788
BDBM50209448
NameBDBM50209448
Synonyms:(3R)-3-(3,5-dichloro-2-hydroxyphenyl)-3-(2-(3-(5-fluoro-1,4,5,6-tetrahydropyrimidin-2-ylamino)-5-hydroxybenzamido)acetamido)propanoic acid | CHEMBL243152
TypeSmall organic molecule
Emp. Form.C22H22Cl2FN5O6
Mol. Mass.542.344
SMILES[#8]-[#6](=O)-[#6]-[#6@@H](-[#7]-[#6](=O)-[#6]-[#7]-[#6](=O)-c1cc(-[#8])cc(c1)\[#7]=[#6]-1\[#7]-[#6]-[#6](F)-[#6]-[#7]-1)-c1cc(Cl)cc(Cl)c1-[#8]