Reaction Details
TargetCytochrome P450 2C19
LigandBDBM50075373
Substrate/Competitorn/a
Meas. Tech.ChEMBL_443556 (CHEMBL893813)
IC50>10000±n/a nM
Citation Labrie, PMaddaford, SPLacroix, JCatalano, CLee, DKRakhit, SGaudreault, RC In vitro activity of novel dual action MDR anthranilamide modulators with inhibitory activity on CYP-450 (Part 2). Bioorg Med Chem15:3854-68 (2007) 
 
Cytochrome P450 2C19
Name:Cytochrome P450 2C19
Type:Enzyme
Mol. Mass.:55935.47
Organism:Homo sapiens (Human)
Description:P33261
Residue:490
BDBM50075373
NameBDBM50075373
Synonyms:1N-{4-[2-(6,7-dimethoxy-1,2,3,4-tetrahydro-2-isoquinolinyl)ethyl]phenyl}-4,5-dimethoxy-2-(3-quinolylcarboxamido)benzamide N-(2-((4-(2-(6,7-dimethoxy-3,4-dihydroisoquinolin-2(1H)-yl)ethyl)phenyl)carbamoyl)-4,5-dimethoxyphenyl)quinoline-3-carboxamide US11739089, Compound Tariquidar
TypeSmall organic molecule
Emp. Form.C38H38N4O6
Mol. Mass.646.7315
SMILESCOc1cc2CCN(CCc3ccc(NC(=O)c4cc(OC)c(OC)cc4NC(=O)c4cnc5ccccc5c4)cc3)Cc2cc1OC