Reaction Details
TargetcAMP and cAMP-inhibited cGMP 3',5'-cyclic phosphodiesterase 10A
LigandBDBM50209524
Substrate/Competitorn/a
Meas. Tech.ChEMBL_455270 (CHEMBL886046)
IC50>4000±n/a nM
Citation Cantin, LDMagnuson, SGunn, DBarucci, NBreuhaus, MBullock, WHBurke, JClaus, THDaly, MDecarr, LGore-Willse, AHoover-Litty, HKumarasinghe, ESLi, YLiang, SXLivingston, JNLowinger, TMacdougall, MOgutu, HOOlague, AOtt-Morgan, RSchoenleber, RWTersteegen, AWickens, PZhang, ZZhu, JZhu, LSweet, LJ PDE-10A inhibitors as insulin secretagogues. Bioorg Med Chem Lett17:2869-73 (2007) 
 
cAMP and cAMP-inhibited cGMP 3',5'-cyclic phosphodiesterase 10A
Name:cAMP and cAMP-inhibited cGMP 3',5'-cyclic phosphodiesterase 10A
Type:Protein
Mol. Mass.:88412.52
Organism:Homo sapiens (Human)
Description:Q9Y233
Residue:1055
BDBM50209524
NameBDBM50209524
Synonyms:(R)-2-[3-cyano-2-(2'-ethoxy-biphenyl-4-yl)-5,6-difluoro-quinolin-4-ylamino]-propionic acid | CHEMBL396094
TypeSmall organic molecule
Emp. Form.C27H21F2N3O3
Mol. Mass.473.4707
SMILESCCOc1ccccc1-c1ccc(cc1)-c1nc2ccc(F)c(F)c2c(N[C@H](C)C(O)=O)c1C#N