Reaction Details
TargetcAMP and cAMP-inhibited cGMP 3',5'-cyclic phosphodiesterase 10A
LigandBDBM50209528
Substrate/Competitorn/a
Meas. Tech.ChEMBL_455270 (CHEMBL886046)
IC50 45±n/a nM
Citation Cantin, LDMagnuson, SGunn, DBarucci, NBreuhaus, MBullock, WHBurke, JClaus, THDaly, MDecarr, LGore-Willse, AHoover-Litty, HKumarasinghe, ESLi, YLiang, SXLivingston, JNLowinger, TMacdougall, MOgutu, HOOlague, AOtt-Morgan, RSchoenleber, RWTersteegen, AWickens, PZhang, ZZhu, JZhu, LSweet, LJ PDE-10A inhibitors as insulin secretagogues. Bioorg Med Chem Lett17:2869-73 (2007) 
 
cAMP and cAMP-inhibited cGMP 3',5'-cyclic phosphodiesterase 10A
Name:cAMP and cAMP-inhibited cGMP 3',5'-cyclic phosphodiesterase 10A
Type:Protein
Mol. Mass.:88412.52
Organism:Homo sapiens (Human)
Description:Q9Y233
Residue:1055
BDBM50209528
NameBDBM50209528
Synonyms:3-[2-(2'-morpholin-4-ylmethyl-biphenyl-4-yl)-quinolin-4-ylamino]-propionic acid | CHEMBL397129
TypeSmall organic molecule
Emp. Form.C29H29N3O3
Mol. Mass.467.5589
SMILESOC(=O)CCNc1cc(nc2ccccc12)-c1ccc(cc1)-c1ccccc1CN1CCOCC1