Reaction Details
TargetCytochrome P450 2C9
LigandBDBM50209512
Substrate/Competitorn/a
Meas. Tech.ChEMBL_455271 (CHEMBL886047)
IC50 66±n/a nM
Citation Cantin, LDMagnuson, SGunn, DBarucci, NBreuhaus, MBullock, WHBurke, JClaus, THDaly, MDecarr, LGore-Willse, AHoover-Litty, HKumarasinghe, ESLi, YLiang, SXLivingston, JNLowinger, TMacdougall, MOgutu, HOOlague, AOtt-Morgan, RSchoenleber, RWTersteegen, AWickens, PZhang, ZZhu, JZhu, LSweet, LJ PDE-10A inhibitors as insulin secretagogues. Bioorg Med Chem Lett17:2869-73 (2007) 
 
Cytochrome P450 2C9
Name:Cytochrome P450 2C9
Type:Enzyme
Mol. Mass.:55636.33
Organism:Homo sapiens (Human)
Description:P11712
Residue:490
BDBM50209512
NameBDBM50209512
Synonyms:(S)-2-[3-cyano-2-(2'-ethoxy-biphenyl-4-yl)-6-fluoro-quinolin-4-ylamino]-propionic acid | CHEMBL397600
TypeSmall organic molecule
Emp. Form.C27H22FN3O3
Mol. Mass.455.4803
SMILESCCOc1ccccc1-c1ccc(cc1)-c1nc2ccc(F)cc2c(N[C@@H](C)C(O)=O)c1C#N