Reaction Details
TargetSodium-dependent noradrenaline transporter
LigandBDBM50210952
Substrate/Competitorn/a
Meas. Tech.ChEMBL_444173 (CHEMBL893332)
Ki 4.88±n/a nM
Citation Zeng, FStehouwer, JSJarkas, NVoll, RJWilliams, LCamp, VMVotaw, JROwens, MJKilts, CDNemeroff, CBGoodman, MM Synthesis and biological evaluation of 2beta,3alpha-(substituted phenyl)nortropanes as potential norepinephrine transporter imaging agents. Bioorg Med Chem Lett17:3044-7 (2007) 
 
Sodium-dependent noradrenaline transporter
Name:Sodium-dependent noradrenaline transporter
Type:Multi-pass membrane protein
Mol. Mass.:69337.72
Organism:Homo sapiens (Human)
Description:P23975
Residue:617
BDBM50210952
NameBDBM50210952
Synonyms:(1R,2S,3R,5R)-methyl 3-p-tolyl-8-aza-bicyclo[3.2.1]octane-2-carboxylate | CHEMBL235569
TypeSmall organic molecule
Emp. Form.C16H21NO2
Mol. Mass.259.3434
SMILESCOC(=O)[C@@H]1[C@H]2CC[C@H](C[C@H]1c1ccc(C)cc1)N2