Reaction Details
TargetSodium-dependent serotonin transporter
LigandBDBM50210953
Substrate/Competitorn/a
Meas. Tech.ChEMBL_444174 (CHEMBL893333)
Ki 3.45±n/a nM
Citation Zeng, FStehouwer, JSJarkas, NVoll, RJWilliams, LCamp, VMVotaw, JROwens, MJKilts, CDNemeroff, CBGoodman, MM Synthesis and biological evaluation of 2beta,3alpha-(substituted phenyl)nortropanes as potential norepinephrine transporter imaging agents. Bioorg Med Chem Lett17:3044-7 (2007) 
 
Sodium-dependent serotonin transporter
Name:Sodium-dependent serotonin transporter
Type:Multi-pass membrane protein
Mol. Mass.:70322.51
Organism:Homo sapiens (Human)
Description:P31645
Residue:630
BDBM50210953
NameBDBM50210953
Synonyms:(1R,2S,3R,5R)-methyl 3-(4-ethynylphenyl)-8-aza-bicyclo[3.2.1]octane-2-carboxylate | CHEMBL394158
TypeSmall organic molecule
Emp. Form.C17H19NO2
Mol. Mass.269.3383
SMILESCOC(=O)[C@@H]1[C@H]2CC[C@H](C[C@H]1c1ccc(cc1)C#C)N2