Reaction Details
TargetGlycogen phosphorylase, liver form
LigandBDBM50211289
Substrate/Competitorn/a
Meas. Tech.ChEMBL_444271 (CHEMBL894512)
Ki 12000±n/a nM
Citation Juhász, LDocsa, TBrunyászki, AGergely, PAntus, S Synthesis and glycogen phosphorylase inhibitor activity of 2,3-dihydrobenzo[1,4]dioxin derivatives. Bioorg Med Chem15:4048-56 (2007) 
 
Glycogen phosphorylase, liver form
Name:Glycogen phosphorylase, liver form
Type:Homodimer
Mol. Mass.:97153.98
Organism:Homo sapiens (Human)
Description:Dimers associate into a tetramer to form the enzymatically active phosphorylase A.
Residue:847
BDBM50211289
NameBDBM50211289
Synonyms:5-[4-(6,7-dibromo-2,3-dihydrobenzo[1,4]dioxin-2-ylmethoxy)-benzylidene]-thiazolidine-2,4-dione | CHEMBL242918
TypeSmall organic molecule
Emp. Form.C19H13Br2NO5S
Mol. Mass.527.183
SMILESOC1=NC(=O)C(S1)=Cc1ccc(OCC2COc3cc(Br)c(Br)cc3O2)cc1