Reaction Details
TargetGlycogen phosphorylase, liver form
LigandBDBM50211294
Substrate/Competitorn/a
Meas. Tech.ChEMBL_444271 (CHEMBL894512)
Ki 5100±n/a nM
Citation Juhász, LDocsa, TBrunyászki, AGergely, PAntus, S Synthesis and glycogen phosphorylase inhibitor activity of 2,3-dihydrobenzo[1,4]dioxin derivatives. Bioorg Med Chem15:4048-56 (2007) 
 
Glycogen phosphorylase, liver form
Name:Glycogen phosphorylase, liver form
Type:Homodimer
Mol. Mass.:97153.98
Organism:Homo sapiens (Human)
Description:Dimers associate into a tetramer to form the enzymatically active phosphorylase A.
Residue:847
BDBM50211294
NameBDBM50211294
Synonyms:(7R,8S,9S,10R)-8,9,10-trihydroxy-7-hydroxymethyl-2-thioxo-6-oxa-1,3-diaza-spiro[4.5]decan-4-one | CHEMBL232698
TypeSmall organic molecule
Emp. Form.C8H12N2O6S
Mol. Mass.264.256
SMILESOC[C@H]1OC2(NC(=S)NC2=O)[C@H](O)[C@@H](O)[C@@H]1O