Reaction Details
TargetMitogen-activated protein kinase 10
LigandBDBM50211428
Substrate/Competitorn/a
Meas. Tech.ChEMBL_455592 (CHEMBL886372)
IC50 5±n/a nM
Citation Alam, MBeevers, RECeska, TDavenport, RJDickson, KMFortunato, MGowers, LHaughan, AFJames, LAJones, MWKinsella, NLowe, CMeissner, JWNicolas, ALPerry, BGPhillips, DJPitt, WRPlatt, ARatcliffe, AJSharpe, ATait, LJ Synthesis and SAR of aminopyrimidines as novel c-Jun N-terminal kinase (JNK) inhibitors. Bioorg Med Chem Lett17:3463-7 (2007) 
 
Mitogen-activated protein kinase 10
Name:Mitogen-activated protein kinase 10
Type:Enzyme
Mol. Mass.:52586.89
Organism:Homo sapiens (Human)
Description:n/a
Residue:464
BDBM50211428
NameBDBM50211428
Synonyms:CHEMBL245936 | N-ethyl-4-(4-(2-phenyl-1H-indol-3-yl)pyrimidin-2-ylamino)piperidine-1-carboxamide
TypeSmall organic molecule
Emp. Form.C26H28N6O
Mol. Mass.440.5401
SMILESCCNC(=O)N1CCC(CC1)Nc1nccc(n1)-c1c([nH]c2ccccc12)-c1ccccc1