Reaction Details
TargetTranscription factor Jun
LigandBDBM50211430
Substrate/Competitorn/a
Meas. Tech.ChEMBL_455594 (CHEMBL886374)
IC50 813±n/a nM
Citation Alam, MBeevers, RECeska, TDavenport, RJDickson, KMFortunato, MGowers, LHaughan, AFJames, LAJones, MWKinsella, NLowe, CMeissner, JWNicolas, ALPerry, BGPhillips, DJPitt, WRPlatt, ARatcliffe, AJSharpe, ATait, LJ Synthesis and SAR of aminopyrimidines as novel c-Jun N-terminal kinase (JNK) inhibitors. Bioorg Med Chem Lett17:3463-7 (2007) 
 
Transcription factor Jun
Name:Transcription factor Jun
Type:n/a
Mol. Mass.:35683.24
Organism:Homo sapiens (Human)
Description:P05412
Residue:331
BDBM50211430
NameBDBM50211430
Synonyms:(4-(5-chloro-4-(1H-indol-3-yl)pyrimidin-2-ylamino)piperidin-1-yl)(4-methylpiperidin-1-yl)methanone | CHEMBL245733
TypeSmall organic molecule
Emp. Form.C24H29ClN6O
Mol. Mass.452.98
SMILESCC1CCN(CC1)C(=O)N1CCC(CC1)Nc1ncc(Cl)c(n1)-c1c[nH]c2ccccc12