Reaction Details
TargetCoagulation factor X
LigandBDBM50211563
Substrate/Competitorn/a
Meas. Tech.ChEMBL_438714 (CHEMBL889048)
Ki 0.24±n/a nM
Citation Dönnecke, DSchweinitz, AStürzebecher, ASteinmetzer, PSchuster, MStürzebecher, UNicklisch, SStürzebecher, JSteinmetzer, T From selective substrate analogue factor Xa inhibitors to dual inhibitors of thrombin and factor Xa. Part 3. Bioorg Med Chem Lett17:3322-9 (2007) 
 
Coagulation factor X
Name:Coagulation factor X
Type:Enzyme
Mol. Mass.:54726.60
Organism:Homo sapiens (Human)
Description:n/a
Residue:488
BDBM50211563
NameBDBM50211563
Synonyms:(S)-4-(2-aminomethyl-5-chloro-benzylcarbamoyl)-4-{methoxy-[(R)-4-(1-oxy-pyridin-2-yl)-2-phenylmethanesulfonylamino-butyryl]-amino}-butyric acid | CHEMBL397895
TypeSmall organic molecule
Emp. Form.C30H36ClN5O8S
Mol. Mass.662.154
SMILESCON([C@@H](CCC(O)=O)C(=O)NCc1cc(Cl)ccc1CN)C(=O)[C@@H](CCc1cccc[n+]1[O-])NS(=O)(=O)Cc1ccccc1