Reaction Details
TargetCoagulation factor X
LigandBDBM50211582
Substrate/Competitorn/a
Meas. Tech.ChEMBL_438714 (CHEMBL889048)
Ki 0.32±n/a nM
Citation Dönnecke, DSchweinitz, AStürzebecher, ASteinmetzer, PSchuster, MStürzebecher, UNicklisch, SStürzebecher, JSteinmetzer, T From selective substrate analogue factor Xa inhibitors to dual inhibitors of thrombin and factor Xa. Part 3. Bioorg Med Chem Lett17:3322-9 (2007) 
 
Coagulation factor X
Name:Coagulation factor X
Type:Enzyme
Mol. Mass.:54726.60
Organism:Homo sapiens (Human)
Description:n/a
Residue:488
BDBM50211582
NameBDBM50211582
Synonyms:(R)-N-[(4-carbamimidoyl-benzylcarbamoyl)-methyl]-4-(1-oxy-pyridin-2-yl)-2-phenylmethanesulfonylamino-butyramide | CHEMBL395719
TypeSmall organic molecule
Emp. Form.C26H30N6O5S
Mol. Mass.538.619
SMILESNC(=N)c1ccc(CNC(=O)CNC(=O)[C@@H](CCc2cccc[n+]2[O-])NS(=O)(=O)Cc2ccccc2)cc1