Reaction Details
TargetCoagulation factor X
LigandBDBM50211564
Substrate/Competitorn/a
Meas. Tech.ChEMBL_438714 (CHEMBL889048)
Ki 0.095±n/a nM
Citation Dönnecke, DSchweinitz, AStürzebecher, ASteinmetzer, PSchuster, MStürzebecher, UNicklisch, SStürzebecher, JSteinmetzer, T From selective substrate analogue factor Xa inhibitors to dual inhibitors of thrombin and factor Xa. Part 3. Bioorg Med Chem Lett17:3322-9 (2007) 
 
Coagulation factor X
Name:Coagulation factor X
Type:Enzyme
Mol. Mass.:54726.60
Organism:Homo sapiens (Human)
Description:n/a
Residue:488
BDBM50211564
NameBDBM50211564
Synonyms:(R)-N-[(5-chloro-2-ethyl-benzylcarbamoyl)-methyl]-4-(1-oxy-pyridin-2-yl)-2-phenylmethanesulfonylamino-butyramide | CHEMBL397921
TypeSmall organic molecule
Emp. Form.C26H30ClN5O5S
Mol. Mass.560.065
SMILESNCc1ccc(Cl)cc1CNC(=O)CNC(=O)[C@@H](CCc1cccc[n+]1[O-])NS(=O)(=O)Cc1ccccc1