Reaction Details
TargetCoagulation factor X
LigandBDBM50211587
Substrate/Competitorn/a
Meas. Tech.ChEMBL_438714 (CHEMBL889048)
Ki 0.63±n/a nM
Citation Dönnecke, DSchweinitz, AStürzebecher, ASteinmetzer, PSchuster, MStürzebecher, UNicklisch, SStürzebecher, JSteinmetzer, T From selective substrate analogue factor Xa inhibitors to dual inhibitors of thrombin and factor Xa. Part 3. Bioorg Med Chem Lett17:3322-9 (2007) 
 
Coagulation factor X
Name:Coagulation factor X
Type:Enzyme
Mol. Mass.:54726.60
Organism:Homo sapiens (Human)
Description:n/a
Residue:488
BDBM50211587
NameBDBM50211587
Synonyms:CHEMBL427464 | N-[(R)-1-[(S)-2-(2-aminomethyl-5-chloro-benzylcarbamoyl)-pyrrolidine-1-carbonyl]-3-(1-oxy-pyridin-2-yl)-propyl]-oxalamic acid methyl ester
TypeSmall organic molecule
Emp. Form.C25H30ClN5O6
Mol. Mass.531.989
SMILESCOC(=O)C(=O)N[C@H](CCc1cccc[n+]1[O-])C(=O)N1CCC[C@H]1C(=O)NCc1cc(Cl)ccc1CN