Reaction Details
TargetCoagulation factor X
LigandBDBM50211578
Substrate/Competitorn/a
Meas. Tech.ChEMBL_438714 (CHEMBL889048)
Ki 0.049±n/a nM
Citation Dönnecke, DSchweinitz, AStürzebecher, ASteinmetzer, PSchuster, MStürzebecher, UNicklisch, SStürzebecher, JSteinmetzer, T From selective substrate analogue factor Xa inhibitors to dual inhibitors of thrombin and factor Xa. Part 3. Bioorg Med Chem Lett17:3322-9 (2007) 
 
Coagulation factor X
Name:Coagulation factor X
Type:Enzyme
Mol. Mass.:54726.60
Organism:Homo sapiens (Human)
Description:n/a
Residue:488
BDBM50211578
NameBDBM50211578
Synonyms:(S)-1-[(R)-4-(1-oxy-pyridin-2-yl)-2-phenylmethanesulfonylamino-butyryl]-pyrrolidine-2-carboxylic acid 2-aminomethyl-5-chloro-benzylamide | CHEMBL396286
TypeSmall organic molecule
Emp. Form.C29H34ClN5O5S
Mol. Mass.600.129
SMILESNCc1ccc(Cl)cc1CNC(=O)[C@@H]1CCCN1C(=O)[C@@H](CCc1cccc[n+]1[O-])NS(=O)(=O)Cc1ccccc1