Reaction Details
TargetCannabinoid receptor 1
LigandBDBM50211615
Substrate/Competitorn/a
Meas. Tech.ChEMBL_455617 (CHEMBL886398)
Ki 119±n/a nM
Citation Lavey, BJKozlowski, JAShankar, BBSpitler, JMZhou, GYang, DYShu, YWong, MKWong, SCShih, NYWu, JMcCombie, SWRizvi, RWolin, RLLunn, CA Optimization of triaryl bis-sulfones as cannabinoid-2 receptor ligands. Bioorg Med Chem Lett17:3760-4 (2007) 
 
Cannabinoid receptor 1
Name:Cannabinoid receptor 1
Type:G Protein-Coupled Receptor (GPCR)
Mol. Mass.:52868.96
Organism:Homo sapiens (Human)
Description:P21554
Residue:472
BDBM50211615
NameBDBM50211615
Synonyms:CHEMBL245778 | N-((S)-1-{4-[4-chloro-2-(1-oxy-pyridine-2-sulfonyl)-benzenesulfonyl]-phenyl}-ethyl)-methanesulfonamide
TypeSmall organic molecule
Emp. Form.C20H19ClN2O7S3
Mol. Mass.531.022
SMILESC[C@H](NS(C)(=O)=O)c1ccc(cc1)S(=O)(=O)c1ccc(Cl)cc1S(=O)(=O)c1cccc[n+]1[O-]